Периодическое мигание экрана ноутбука

У меня есть шанс 50/50, что при загрузке мой экран будет как бы мигать / мерцать каждые 5 секунд или около того. Если он собирается мигать, он запускается, когда ноутбук загружается, я представляю, когда загружаются графические драйверы, поскольку вы можете видеть разницу в яркости экрана при загрузке команд при использовании GRUB_CMDLINE_LINUX_DEFAULT = "text nouveau.modeset = 0 "

Моя система не загружается с драйвером Nouveau, поэтому я отключил его и попробовал рекомендуемый драйвер 440, а также 435. В настоящее время я использую драйвер NVIDIA 450, который является единственным драйвером, который будет работать с программным обеспечением сервера x. У всех трех драйверов одна и та же проблема с миганием.

Я попытался выполнить новую установку с теми же проблемами, и я попытался обновить свое ядро ​​до версии 5.8rc7.

Моим единственным решением является перезагрузка ноутбука.

ASUS Rog G15 Ryzen 7 с NVIDIA GTX1660ti

ubuntu 20.04lts

sudo dmidecode -s bios-version 
GA502IU.216

бесплатно -h

              total        used        free      shared  buff/cache   available
Mem:           15Gi       1.4Gi        12Gi        43Mi       1.4Gi        13Gi
Swap:         2.0Gi          0B       2.0Gi
sysctl vm.swappiness
vm.swappiness = 60

https://justpaste.it/8c8x1 - Я прикрепил это, если форматирование ниже не настолько читабельно .

`sudo lshw -C memory

  *-firmware                
       description: BIOS
       vendor: American Megatrends Inc.
       physical id: 0
       version: GA502IU.217
       date: 08/03/2020
       size: 64KiB
       capacity: 16MiB
       capabilities: pci upgrade shadowing cdboot bootselect socketedrom edd int13floppy1200 int13floppy720 int13floppy2880 int5printscreen int9keyboard int14serial int17printer acpi usb smartbattery biosbootspecification uefi
  *-memory
       description: System Memory
       physical id: a
       slot: System board or motherboard
       size: 16GiB
     *-bank:0
          description: SODIMM DDR4 Synchronous Unbuffered (Unregistered) 3200 MHz (0.3 ns)
          product: 8ATF1G64HZ-3G2J1
          vendor: Micron Technology
          physical id: 0
          serial: 00000000
          slot: DIMM 0
          size: 8GiB
          width: 64 bits
          clock: 3200MHz (0.3ns)
     *-bank:1
          description: SODIMM DDR4 Synchronous Unbuffered (Unregistered) 3200 MHz (0.3 ns)
          product: 8ATF1G64HZ-3G2J1
          vendor: Micron Technology
          physical id: 1
          serial: 24F55C3D
          slot: DIMM 0
          size: 8GiB
          width: 64 bits
          clock: 3200MHz (0.3ns)
  *-cache:0
       description: L1 cache
       physical id: c
       slot: L1 - Cache
       size: 512KiB
       capacity: 512KiB
       clock: 1GHz (1.0ns)
       capabilities: pipeline-burst internal write-back unified
       configuration: level=1
  *-cache:1
       description: L2 cache
       physical id: d
       slot: L2 - Cache
       size: 4MiB
       capacity: 4MiB
       clock: 1GHz (1.0ns)
       capabilities: pipeline-burst internal write-back unified
       configuration: level=2
  *-cache:2
       description: L3 cache
       physical id: e
       slot: L3 - Cache
       size: 8MiB
       capacity: 8MiB
       clock: 1GHz (1.0ns)
       capabilities: pipeline-burst internal write-back unified
       configuration: level=3`

430 журнал ошибок установки DKMS make.log

Tue 18 Aug 20:54:05 BST 2020
make[1]: Entering directory '/usr/src/linux-headers-5.4.0-42-generic'
  SYMLINK /var/lib/dkms/nvidia/430.09/build/nvidia/nv-kernel.o
  SYMLINK /var/lib/dkms/nvidia/430.09/build/nvidia-modeset/nv-modeset-kernel.o
 CONFTEST: INIT_WORK
 CONFTEST: hash__remap_4k_pfn
 CONFTEST: list_is_first
 CONFTEST: set_pages_uc
 CONFTEST: set_memory_uc
 CONFTEST: set_memory_array_uc
 CONFTEST: acquire_console_sem
 CONFTEST: console_lock
 CONFTEST: ioremap_cache
 CONFTEST: ioremap_wc
 CONFTEST: acpi_walk_namespace
 CONFTEST: sg_alloc_table
 CONFTEST: pci_get_domain_bus_and_slot
 CONFTEST: get_num_physpages
 CONFTEST: efi_enabled
 CONFTEST: pde_data
 CONFTEST: proc_remove
 CONFTEST: pm_vt_switch_required
 CONFTEST: xen_ioemu_inject_msi
 CONFTEST: phys_to_dma
 CONFTEST: get_dma_ops
 CONFTEST: write_cr4
 CONFTEST: of_get_property
 CONFTEST: of_find_node_by_phandle
 CONFTEST: of_node_to_nid
 CONFTEST: pnv_pci_get_npu_dev
 CONFTEST: of_get_ibm_chip_id
 CONFTEST: for_each_online_node
 CONFTEST: node_end_pfn
 CONFTEST: pci_bus_address
 CONFTEST: pci_stop_and_remove_bus_device
 CONFTEST: pci_remove_bus_device
 CONFTEST: register_cpu_notifier
 CONFTEST: cpuhp_setup_state
 CONFTEST: dma_map_resource
 CONFTEST: backlight_device_register
 CONFTEST: register_acpi_notifier
 CONFTEST: timer_setup
 CONFTEST: pci_enable_msix_range
 CONFTEST: do_gettimeofday
 CONFTEST: kernel_read
 CONFTEST: kernel_write
 CONFTEST: address_space_init_once
 CONFTEST: kbasename
 CONFTEST: fatal_signal_pending
 CONFTEST: list_cut_position
 CONFTEST: vzalloc
 CONFTEST: wait_on_bit_lock_argument_count
 CONFTEST: bitmap_clear
 CONFTEST: usleep_range
 CONFTEST: radix_tree_empty
 CONFTEST: radix_tree_replace_slot
 CONFTEST: pnv_npu2_init_context
 CONFTEST: drm_dev_unref
 CONFTEST: drm_reinit_primary_mode_group
 CONFTEST: get_user_pages_remote
 CONFTEST: get_user_pages
 CONFTEST: drm_gem_object_lookup
 CONFTEST: drm_atomic_state_ref_counting
 CONFTEST: drm_driver_has_gem_prime_res_obj
 CONFTEST: drm_atomic_helper_connector_dpms
 CONFTEST: drm_connector_funcs_have_mode_in_name
 CONFTEST: vmf_insert_pfn
 CONFTEST: drm_framebuffer_get
 CONFTEST: drm_gem_object_get
 CONFTEST: drm_dev_put
 CONFTEST: is_export_symbol_gpl_of_node_to_nid
 CONFTEST: is_export_symbol_present_swiotlb_map_sg_attrs
 CONFTEST: is_export_symbol_present_swiotlb_dma_ops
 CONFTEST: acpi_op_remove
 CONFTEST: outer_flush_all
 CONFTEST: scatterlist
 CONFTEST: file_operations
 CONFTEST: vm_operations_struct
 CONFTEST: atomic_long_type
 CONFTEST: file_inode
 CONFTEST: task_struct
 CONFTEST: kuid_t
 CONFTEST: dma_ops
 CONFTEST: swiotlb_dma_ops
 CONFTEST: dma_map_ops
 CONFTEST: noncoherent_swiotlb_dma_ops
 CONFTEST: vm_fault_present
 CONFTEST: vm_fault_has_address
 CONFTEST: backlight_properties_type
 CONFTEST: vm_insert_pfn_prot
 CONFTEST: vmf_insert_pfn_prot
 CONFTEST: vm_ops_fault_removed_vma_arg
 CONFTEST: vmbus_channel_has_ringbuffer_page
 CONFTEST: fault_flags
 CONFTEST: atomic64_type
 CONFTEST: address_space
 CONFTEST: backing_dev_info
 CONFTEST: mm_context_t
 CONFTEST: node_states_n_memory
 CONFTEST: drm_bus_present
 CONFTEST: drm_bus_has_bus_type
 CONFTEST: drm_bus_has_get_irq
 CONFTEST: drm_bus_has_get_name
 CONFTEST: drm_driver_has_legacy_dev_list
 CONFTEST: drm_driver_has_set_busid
 CONFTEST: drm_crtc_state_has_connectors_changed
 CONFTEST: drm_init_function_args
 CONFTEST: drm_mode_connector_list_update_has_merge_type_bits_arg
 CONFTEST: drm_master_drop_has_from_release_arg
 CONFTEST: drm_helper_mode_fill_fb_struct
 CONFTEST: drm_driver_unload_has_int_return_type
 CONFTEST: kref_has_refcount_of_type_refcount_t
 CONFTEST: drm_atomic_helper_crtc_destroy_state_has_crtc_arg
 CONFTEST: drm_crtc_helper_funcs_has_atomic_enable
 CONFTEST: drm_mode_object_find_has_file_priv_arg
 CONFTEST: dma_buf_owner
 CONFTEST: drm_connector_list_iter
 CONFTEST: drm_atomic_helper_swap_state_has_stall_arg
 CONFTEST: dom0_kernel_present
 CONFTEST: nvidia_vgpu_hyperv_available
 CONFTEST: nvidia_vgpu_kvm_build
 CONFTEST: nvidia_grid_build
 CONFTEST: pm_runtime_available
 CONFTEST: drm_available
 CONFTEST: drm_atomic_available
 CONFTEST: is_export_symbol_gpl_refcount_inc
 CONFTEST: is_export_symbol_gpl_refcount_dec_and_test
  CC [M]  /var/lib/dkms/nvidia/430.09/build/nvidia/nv-frontend.o
  CC [M]  /var/lib/dkms/nvidia/430.09/build/nvidia/nv-instance.o
  CC [M]  /var/lib/dkms/nvidia/430.09/build/nvidia/nv.o
  CC [M]  /var/lib/dkms/nvidia/430.09/build/nvidia/nv-acpi.o
  CC [M]  /var/lib/dkms/nvidia/430.09/build/nvidia/nv-chrdev.o
  CC [M]  /var/lib/dkms/nvidia/430.09/build/nvidia/nv-cray.o
  CC [M]  /var/lib/dkms/nvidia/430.09/build/nvidia/nv-dma.o
  CC [M]  /var/lib/dkms/nvidia/430.09/build/nvidia/nv-gvi.o
  CC [M]  /var/lib/dkms/nvidia/430.09/build/nvidia/nv-i2c.o
  CC [M]  /var/lib/dkms/nvidia/430.09/build/nvidia/nv-mempool.o
  CC [M]  /var/lib/dkms/nvidia/430.09/build/nvidia/nv-mmap.o
  CC [M]  /var/lib/dkms/nvidia/430.09/build/nvidia/nv-p2p.o
In file included from ./include/linux/bitops.h:5,
                 from ./include/linux/kernel.h:12,
                 from ./include/linux/list.h:9,
                 from ./include/linux/preempt.h:11,
                 from ./include/linux/spinlock.h:51,
                 from /var/lib/dkms/nvidia/430.09/build/common/inc/nv-lock.h:16,
                 from /var/lib/dkms/nvidia/430.09/build/common/inc/nv-linux.h:19,
                 from /var/lib/dkms/nvidia/430.09/build/nvidia/nv.c:14:
./include/linux/bits.h:8: warning: "BIT" redefined
    8 | #define BIT(nr)   (UL(1) << (nr))
      | 
In file included from /var/lib/dkms/nvidia/430.09/build/nvidia/nv.c:12:
/var/lib/dkms/nvidia/430.09/build/common/inc/nvmisc.h:58: note: this is the location of the previous definition
   58 | #define BIT(b)                  (1U<<(b))
      | 
  CC [M]  /var/lib/dkms/nvidia/430.09/build/nvidia/nv-pat.o
  CC [M]  /var/lib/dkms/nvidia/430.09/build/nvidia/nv-procfs.o
  CC [M]  /var/lib/dkms/nvidia/430.09/build/nvidia/nv-usermap.o
  CC [M]  /var/lib/dkms/nvidia/430.09/build/nvidia/nv-vm.o
In file included from /var/lib/dkms/nvidia/430.09/build/nvidia/nv-chrdev.c:15:
/var/lib/dkms/nvidia/430.09/build/common/inc/nv-linux.h:1593:6: error: "NV_BUILD_MODULE_INSTANCES" is not defined, evaluates to 0 [-Werror=undef]
 1593 | #if (NV_BUILD_MODULE_INSTANCES != 0)
      |      ^~~~~~~~~~~~~~~~~~~~~~~~~
In file included from /var/lib/dkms/nvidia/430.09/build/nvidia/nv-instance.c:13:
/var/lib/dkms/nvidia/430.09/build/common/inc/nv-linux.h:1593:6: error: "NV_BUILD_MODULE_INSTANCES" is not defined, evaluates to 0 [-Werror=undef]
 1593 | #if (NV_BUILD_MODULE_INSTANCES != 0)
      |      ^~~~~~~~~~~~~~~~~~~~~~~~~
In file included from /var/lib/dkms/nvidia/430.09/build/nvidia/nv.c:14:
/var/lib/dkms/nvidia/430.09/build/common/inc/nv-linux.h:1593:6: error: "NV_BUILD_MODULE_INSTANCES" is not defined, evaluates to 0 [-Werror=undef]
 1593 | #if (NV_BUILD_MODULE_INSTANCES != 0)
      |      ^~~~~~~~~~~~~~~~~~~~~~~~~
In file included from /var/lib/dkms/nvidia/430.09/build/nvidia/nv-dma.c:15:
/var/lib/dkms/nvidia/430.09/build/common/inc/nv-linux.h:1593:6: error: "NV_BUILD_MODULE_INSTANCES" is not defined, evaluates to 0 [-Werror=undef]
 1593 | #if (NV_BUILD_MODULE_INSTANCES != 0)
      |      ^~~~~~~~~~~~~~~~~~~~~~~~~
In file included from /var/lib/dkms/nvidia/430.09/build/nvidia/nv-acpi.c:15:
/var/lib/dkms/nvidia/430.09/build/common/inc/nv-linux.h:1593:6: error: "NV_BUILD_MODULE_INSTANCES" is not defined, evaluates to 0 [-Werror=undef]
 1593 | #if (NV_BUILD_MODULE_INSTANCES != 0)
      |      ^~~~~~~~~~~~~~~~~~~~~~~~~
In file included from /var/lib/dkms/nvidia/430.09/build/nvidia/nv-cray.c:15:
/var/lib/dkms/nvidia/430.09/build/common/inc/nv-linux.h:1593:6: error: "NV_BUILD_MODULE_INSTANCES" is not defined, evaluates to 0 [-Werror=undef]
 1593 | #if (NV_BUILD_MODULE_INSTANCES != 0)
      |      ^~~~~~~~~~~~~~~~~~~~~~~~~
/var/lib/dkms/nvidia/430.09/build/nvidia/nv.c:42:6: error: "NV_BUILD_MODULE_INSTANCES" is not defined, evaluates to 0 [-Werror=undef]
   42 | #if (NV_BUILD_MODULE_INSTANCES != 0)
      |      ^~~~~~~~~~~~~~~~~~~~~~~~~
In file included from /var/lib/dkms/nvidia/430.09/build/nvidia/nv-gvi.c:15:
/var/lib/dkms/nvidia/430.09/build/common/inc/nv-linux.h:1593:6: error: "NV_BUILD_MODULE_INSTANCES" is not defined, evaluates to 0 [-Werror=undef]
 1593 | #if (NV_BUILD_MODULE_INSTANCES != 0)
      |      ^~~~~~~~~~~~~~~~~~~~~~~~~
/var/lib/dkms/nvidia/430.09/build/nvidia/nv.c: In function ‘nvidia_init_module’:
/var/lib/dkms/nvidia/430.09/build/nvidia/nv.c:786:6: error: "NV_BUILD_MODULE_INSTANCES" is not defined, evaluates to 0 [-Werror=undef]
  786 | #if (NV_BUILD_MODULE_INSTANCES != 0)
      |      ^~~~~~~~~~~~~~~~~~~~~~~~~
/var/lib/dkms/nvidia/430.09/build/nvidia/nv.c: At top level:
/var/lib/dkms/nvidia/430.09/build/nvidia/nv.c:882:6: error: "NV_BUILD_MODULE_INSTANCES" is not defined, evaluates to 0 [-Werror=undef]
  882 | #if (NV_BUILD_MODULE_INSTANCES != 0)
      |      ^~~~~~~~~~~~~~~~~~~~~~~~~
In file included from /var/lib/dkms/nvidia/430.09/build/nvidia/nv-i2c.c:15:
/var/lib/dkms/nvidia/430.09/build/common/inc/nv-linux.h:1593:6: error: "NV_BUILD_MODULE_INSTANCES" is not defined, evaluates to 0 [-Werror=undef]
 1593 | #if (NV_BUILD_MODULE_INSTANCES != 0)
      |      ^~~~~~~~~~~~~~~~~~~~~~~~~
In file included from /var/lib/dkms/nvidia/430.09/build/nvidia/nv-mempool.c:15:
/var/lib/dkms/nvidia/430.09/build/common/inc/nv-linux.h:1593:6: error: "NV_BUILD_MODULE_INSTANCES" is not defined, evaluates to 0 [-Werror=undef]
 1593 | #if (NV_BUILD_MODULE_INSTANCES != 0)
      |      ^~~~~~~~~~~~~~~~~~~~~~~~~
In file included from /var/lib/dkms/nvidia/430.09/build/nvidia/nv-frontend.c:13:
/var/lib/dkms/nvidia/430.09/build/common/inc/nv-linux.h:1593:6: error: "NV_BUILD_MODULE_INSTANCES" is not defined, evaluates to 0 [-Werror=undef]
 1593 | #if (NV_BUILD_MODULE_INSTANCES != 0)
      |      ^~~~~~~~~~~~~~~~~~~~~~~~~
cc1: some warnings being treated as errors
cc1: some warnings being treated as errors
/var/lib/dkms/nvidia/430.09/build/nvidia/nv-frontend.c:39:6: error: "NV_BUILD_MODULE_INSTANCES" is not defined, evaluates to 0 [-Werror=undef]
   39 | #if (NV_BUILD_MODULE_INSTANCES != 0)
      |      ^~~~~~~~~~~~~~~~~~~~~~~~~
cc1: some warnings being treated as errors
/var/lib/dkms/nvidia/430.09/build/nvidia/nv-frontend.c: In function ‘nv_init_module’:
/var/lib/dkms/nvidia/430.09/build/nvidia/nv-frontend.c:349:6: error: "NV_BUILD_MODULE_INSTANCES" is not defined, evaluates to 0 [-Werror=undef]
  349 | #if (NV_BUILD_MODULE_INSTANCES != 0)
      |      ^~~~~~~~~~~~~~~~~~~~~~~~~
/var/lib/dkms/nvidia/430.09/build/nvidia/nv-frontend.c: In function ‘nv_exit_module’:
/var/lib/dkms/nvidia/430.09/build/nvidia/nv-frontend.c:364:6: error: "NV_BUILD_MODULE_INSTANCES" is not defined, evaluates to 0 [-Werror=undef]
  364 | #if (NV_BUILD_MODULE_INSTANCES != 0)
      |      ^~~~~~~~~~~~~~~~~~~~~~~~~
make[2]: *** [scripts/Makefile.build:275: /var/lib/dkms/nvidia/430.09/build/nvidia/nv-chrdev.o] Error 1
make[2]: *** Waiting for unfinished jobs....
In file included from /var/lib/dkms/nvidia/430.09/build/nvidia/nv-pat.c:15:
/var/lib/dkms/nvidia/430.09/build/common/inc/nv-linux.h:1593:6: error: "NV_BUILD_MODULE_INSTANCES" is not defined, evaluates to 0 [-Werror=undef]
 1593 | #if (NV_BUILD_MODULE_INSTANCES != 0)
      |      ^~~~~~~~~~~~~~~~~~~~~~~~~
make[2]: *** [scripts/Makefile.build:275: /var/lib/dkms/nvidia/430.09/build/nvidia/nv-instance.o] Error 1
make[2]: *** [scripts/Makefile.build:275: /var/lib/dkms/nvidia/430.09/build/nvidia/nv-cray.o] Error 1
In file included from /var/lib/dkms/nvidia/430.09/build/nvidia/nv-procfs.c:15:
/var/lib/dkms/nvidia/430.09/build/common/inc/nv-linux.h:1593:6: error: "NV_BUILD_MODULE_INSTANCES" is not defined, evaluates to 0 [-Werror=undef]
 1593 | #if (NV_BUILD_MODULE_INSTANCES != 0)
      |      ^~~~~~~~~~~~~~~~~~~~~~~~~
In file included from /var/lib/dkms/nvidia/430.09/build/nvidia/nv-p2p.c:15:
/var/lib/dkms/nvidia/430.09/build/common/inc/nv-linux.h:1593:6: error: "NV_BUILD_MODULE_INSTANCES" is not defined, evaluates to 0 [-Werror=undef]
 1593 | #if (NV_BUILD_MODULE_INSTANCES != 0)
      |      ^~~~~~~~~~~~~~~~~~~~~~~~~
/var/lib/dkms/nvidia/430.09/build/nvidia/nv-p2p.c:19:6: error: "NV_BUILD_MODULE_INSTANCES" is not defined, evaluates to 0 [-Werror=undef]
   19 | #if (NV_BUILD_MODULE_INSTANCES == 0)
      |      ^~~~~~~~~~~~~~~~~~~~~~~~~
cc1: some warnings being treated as errors
make[2]: *** [scripts/Makefile.build:275: /var/lib/dkms/nvidia/430.09/build/nvidia/nv-mempool.o] Error 1
In file included from /var/lib/dkms/nvidia/430.09/build/nvidia/nv-usermap.c:15:
/var/lib/dkms/nvidia/430.09/build/common/inc/nv-linux.h:1593:6: error: "NV_BUILD_MODULE_INSTANCES" is not defined, evaluates to 0 [-Werror=undef]
 1593 | #if (NV_BUILD_MODULE_INSTANCES != 0)
      |      ^~~~~~~~~~~~~~~~~~~~~~~~~
cc1: some warnings being treated as errors
make[2]: *** [scripts/Makefile.build:275: /var/lib/dkms/nvidia/430.09/build/nvidia/nv-gvi.o] Error 1
In file included from /var/lib/dkms/nvidia/430.09/build/nvidia/nv-mmap.c:15:
/var/lib/dkms/nvidia/430.09/build/common/inc/nv-linux.h:1593:6: error: "NV_BUILD_MODULE_INSTANCES" is not defined, evaluates to 0 [-Werror=undef]
 1593 | #if (NV_BUILD_MODULE_INSTANCES != 0)
      |      ^~~~~~~~~~~~~~~~~~~~~~~~~
cc1: some warnings being treated as errors
make[2]: *** [scripts/Makefile.build:275: /var/lib/dkms/nvidia/430.09/build/nvidia/nv-pat.o] Error 1
/var/lib/dkms/nvidia/430.09/build/nvidia/nv-mmap.c: In function ‘nv_encode_caching’:
/var/lib/dkms/nvidia/430.09/build/nvidia/nv-mmap.c:338:16: warning: this statement may fall through [-Wimplicit-fallthrough=]
  338 |             if (NV_ALLOW_CACHING(memory_type))
      |                ^
/var/lib/dkms/nvidia/430.09/build/nvidia/nv-mmap.c:340:9: note: here
  340 |         default:
      |         ^~~~~~~
cc1: some warnings being treated as errors
make[2]: *** [scripts/Makefile.build:275: /var/lib/dkms/nvidia/430.09/build/nvidia/nv-i2c.o] Error 1
cc1: some warnings being treated as errors
make[2]: *** [scripts/Makefile.build:275: /var/lib/dkms/nvidia/430.09/build/nvidia/nv-usermap.o] Error 1
In file included from /var/lib/dkms/nvidia/430.09/build/nvidia/nv-vm.c:14:
/var/lib/dkms/nvidia/430.09/build/common/inc/nv-linux.h:1593:6: error: "NV_BUILD_MODULE_INSTANCES" is not defined, evaluates to 0 [-Werror=undef]
 1593 | #if (NV_BUILD_MODULE_INSTANCES != 0)
      |      ^~~~~~~~~~~~~~~~~~~~~~~~~
cc1: some warnings being treated as errors
make[2]: *** [scripts/Makefile.build:275: /var/lib/dkms/nvidia/430.09/build/nvidia/nv-frontend.o] Error 1
cc1: some warnings being treated as errors
make[2]: *** [scripts/Makefile.build:275: /var/lib/dkms/nvidia/430.09/build/nvidia/nv-dma.o] Error 1
cc1: some warnings being treated as errors
make[2]: *** [scripts/Makefile.build:275: /var/lib/dkms/nvidia/430.09/build/nvidia/nv-mmap.o] Error 1
cc1: some warnings being treated as errors
make[2]: *** [scripts/Makefile.build:275: /var/lib/dkms/nvidia/430.09/build/nvidia/nv-p2p.o] Error 1
cc1: some warnings being treated as errors
make[2]: *** [scripts/Makefile.build:275: /var/lib/dkms/nvidia/430.09/build/nvidia/nv-procfs.o] Error 1
cc1: some warnings being treated as errors
make[2]: *** [scripts/Makefile.build:275: /var/lib/dkms/nvidia/430.09/build/nvidia/nv-vm.o] Error 1
cc1: some warnings being treated as errors
make[2]: *** [scripts/Makefile.build:275: /var/lib/dkms/nvidia/430.09/build/nvidia/nv-acpi.o] Error 1
cc1: some warnings being treated as errors
make[2]: *** [scripts/Makefile.build:275: /var/lib/dkms/nvidia/430.09/build/nvidia/nv.o] Error 1
make[1]: *** [Makefile:1731: /var/lib/dkms/nvidia/430.09/build] Error 2
make[1]: Leaving directory '/usr/src/linux-headers-5.4.0-42-generic'
make: *** [Makefile:79: modules] Error 2```

1
задан 18 August 2020 в 22:55

1 ответ

BIOS

ASUS Rog G15

У вас установлена ​​версия BIOS GA502IU.216.

Доступна более новая версия BIOS, версия GA502IU.217 от 6.08.2020, и его можно загрузить здесь .

Примечание. Подтвердите, что у меня есть правильная веб-страница для вашей модели №.

Примечание. Перед обновлением BIOS

Nvidia

сделайте хорошие резервные копии. Похоже, у вас установлен драйвер Nvidia 450.

Убедитесь, что вы выбрали поддерживаемое разрешение экрана и частоту обновления 60 Гц на панели настроек Дисплеи . Примечание. В Европе частота обновления может составлять 50 Гц.

На их веб-сайте указана другая версия драйвера для вашей Nvidia GTX 1660ti. Версию 430.09 можно загрузить здесь .

enter image description here

enter image description here

swap

Давайте увеличим ваш / swap-файл до 4G ...

Примечание : Неправильное использование команды dd может привести к потере данных. Предложите скопировать / вставить.

sudo swapoff -a           # turn off swap
sudo rm -i /swapfile      # remove old /swapfile

sudo dd if=/dev/zero of=/swapfile bs=1M count=4096

sudo chmod 600 /swapfile  # set proper file protections
sudo mkswap /swapfile     # init /swapfile
sudo swapon /swapfile     # turn on swap
free -h                   # confirm 16G RAM and 4G swap

Подтвердите эту строку в /etc/fstab...[1289 visibleNouveau

Не забудьте изменить /etc/default/grub...

Change:

GRUB_CMDLINE_LINUX_DEFAULT="text nouveau.modeset=0"

To:

GRUB_CMDLINE_LINUX_DEFAULT="quiet splash"

sudo update-grub

Ядро

Удалите ядро ​​5.8rc7 и вернитесь к стандартному ядру 20.04.1. Обратите внимание, что rc7 указывает на кандидат на выпуск 7 и никогда не должен устанавливаться, если вы не разработчик, который хочет протестировать предварительное программное обеспечение.

Обновление №1:

] Процессоры Ryzen печально известны проблемами совместимости памяти.

memtest

Перейдите на https://www.memtest86.com/ и загрузите / запустите их бесплатный memtest для тестирования ваша память. Получите хотя бы один полный проход всех тестов 4/4, чтобы подтвердить хорошую память. Это может занять много часов.

Обновление №2:

Теперь для драйвера Nvidia ...

Переключитесь на новый драйвер или переключитесь на внутреннюю видеокарту Intel, а затем удалите все вещи Nvidia и попробуйте снова переустановить драйвер Nvidia 430.09.

Примечание : Nvidia поставляет собственный деинсталлятор. Вы можете запустить это сначала, а затем выполнить мои команды, чтобы убедиться, что не осталось остатков.

dpkg -l * nvidia * | grep -v "un" # обратите внимание на пробел после un

Это даст вам список всех имен пакетов Nvidia.

Затем выполните:

sudo apt-get purge package_name # для каждого имени пакета

и переустановите 430.09.

Обновление №3:

Наряду с другими модами он отлично работает на ядре 5.9-rc1 и Nvidia 450.

а затем удалите все вещи Nvidia и попробуйте снова переустановить драйвер Nvidia 430.09.

Примечание : Nvidia предоставляет свой собственный деинсталлятор. Вы можете запустить это сначала, а затем выполнить мои команды, чтобы убедиться, что не осталось остатков.

dpkg -l * nvidia * | grep -v "un" # обратите внимание на пробел после un

Это даст вам список всех имен пакетов Nvidia.

Затем выполните:

sudo apt-get purge package_name # для каждого имени пакета

и переустановите 430.09.

Обновление №3:

Наряду с другими модами он отлично работает на ядре 5.9-rc1 и Nvidia 450.

а затем удалите все вещи Nvidia и попробуйте снова переустановить драйвер Nvidia 430.09.

Примечание : Nvidia предоставляет свой собственный деинсталлятор. Вы можете запустить это сначала, а затем выполнить мои команды, чтобы убедиться, что не осталось остатков.

dpkg -l * nvidia * | grep -v "un" # обратите внимание на пробел после un

Это даст вам список всех имен пакетов Nvidia.

Затем выполните:

sudo apt-get purge package_name # для каждого имени пакета

и переустановите 430.09.

Обновление №3:

Наряду с другими модами он отлично работает на ядре 5.9-rc1 и Nvidia 450.

dpkg -l * nvidia * | grep -v "un" # обратите внимание на пробел после un

Это даст вам список всех имен пакетов Nvidia.

Затем выполните:

sudo apt-get purge package_name # для каждого имени пакета

и переустановите 430.09.

Обновление №3:

Наряду с другими модами он отлично работает на ядре 5.9-rc1 и Nvidia 450.

dpkg -l * nvidia * | grep -v "un" # обратите внимание на пробел после un

Это даст вам список всех имен пакетов Nvidia.

Затем выполните:

sudo apt-get purge package_name # для каждого имени пакета

и переустановите 430.09.

Обновление №3:

Наряду с другими модами он отлично работает на ядре 5.9-rc1 и Nvidia 450.

1
ответ дан 21 August 2020 в 07:57

Другие вопросы по тегам:

Похожие вопросы: